ЗАЩИТНИК ОБВИНЯЕМОГО
type: LexicalConcept
holonym: http://lod.ruthes.org/resource/concept/148391
hypernym: http://lod.ruthes.org/resource/concept/2598
definition: участник судебного процесса, представляющий интересы ответчика
in scheme: ruthes
lexicalized sense: 140333-адвокат защиты-ng-0
lexicalized sense: 140333-защитник-n-0
lexicalized sense: 140333-защитник обвиняемого-ng-0