ДЕКЛАРИРОВАТЬ СВЕДЕНИЯ
type: LexicalConcept
hypernym: http://lod.ruthes.org/resource/concept/106542
hypernym: http://lod.ruthes.org/resource/concept/143704
meronym: http://lod.ruthes.org/resource/concept/140585
definition: заполняя налоговые документы, декларации и т. п., вносить в них требуемые данные
in scheme: ruthes
lexicalized sense: 140590-декларативный порядок-ng-0
lexicalized sense: 140590-декларационный-adj-0
lexicalized sense: 140590-декларирование-n-0
lexicalized sense: 140590-декларировать-v-0
lexicalized sense: 140590-декларировать сведения-vg-0
lexicalized sense: 140590-задекларировать-v-0
lexicalized sense: 140590-подавать декларацию-vg-0
lexicalized sense: 140590-подать декларацию-ng-0
lexicalized sense: 140590-подача декларации-ng-0