КОММЕРЧЕСКИЙ ПОДКУП
type: LexicalConcept
association1: http://lod.ruthes.org/resource/concept/3610
hypernym: http://lod.ruthes.org/resource/concept/141381
hypernym: http://lod.ruthes.org/resource/concept/142493
definition: экономическое преступление, направленное против интересов службы в коммерческой или иной организации и состоящее в незаконной передаче лицу, выполняющему управленческие функции, денег, ценных бумаг, иного имущества, а равно незаконное оказание ему услуг имущественного характера за совершение действий (бездействия) в интересах дающего
in scheme: ruthes
lexicalized sense: 140757-коммерческий подкуп-ng-0
lexicalized sense: 140757-коммерческое взяточничество-ng-0