УКРЫВАТЕЛЬСТВО
type: LexicalConcept
hypernym: http://lod.ruthes.org/resource/concept/152834
hypernym: http://lod.ruthes.org/resource/concept/154670
hypernym: http://lod.ruthes.org/resource/concept/7730
definition: действия укрывателя; умышленное скрытие преступника или следов преступления, похищенных вещей и т. п.
in scheme: ruthes
lexicalized sense: 141311-покрывать преступление-vg-0
lexicalized sense: 141311-покрывать преступника-vg-0
lexicalized sense: 141311-укрывательство-n-0