УМОЗАКЛЮЧЕНИЕ ПО АНАЛОГИИ
type: LexicalConcept
association1: http://lod.ruthes.org/resource/concept/116797
hypernym: http://lod.ruthes.org/resource/concept/130888
definition: умозаключение, в котором на основании сходства в каком-либо отношении предметов, явлений, понятий делается вывод об их сходстве и в других отношениях
in scheme: ruthes
lexicalized sense: 141480-аналогия-n-0
lexicalized sense: 141480-вывод по аналогии-ng-0
lexicalized sense: 141480-заключение по аналогии-ng-0
lexicalized sense: 141480-умозаключение по аналогии-ng-0