ЮНГА
type: LexicalConcept
hypernym: http://lod.ruthes.org/resource/concept/2621
hypernym: http://lod.ruthes.org/resource/concept/4022
definition: подросток на судне, готовящийся в матросы
in scheme: ruthes
lexicalized sense: 141965-судовой юнга-ng-0
lexicalized sense: 141965-юнга-n-0
lexicalized sense: 141965-юнга на судне-ng-0
lexicalized sense: 141965-юнга на флоте-ng-0