ПРОДАВЕЦ (ТОРГОВЫЙ РАБОТНИК)
type: LexicalConcept
hypernym: http://lod.ruthes.org/resource/concept/5404
hypernym: http://lod.ruthes.org/resource/concept/5406
hyponym: http://lod.ruthes.org/resource/concept/5403
definition: тот, кто продаёт, торговец (может относиться к человеку за прилавком, владельцу или служащему торговой фирмы, а также к целой торговой компании)
in scheme: ruthes
lexicalized sense: 142776-продавец-n-0
lexicalized sense: 142776-продавец в магазине-ng-0
lexicalized sense: 142776-продавщица-n-0