ПРЕКЛОНЕНИЕ, ПОКЛОНЕНИЕ
type: LexicalConcept
association2: http://lod.ruthes.org/resource/concept/125559
holonym: http://lod.ruthes.org/resource/concept/118494
hypernym: http://lod.ruthes.org/resource/concept/106968
definition: глубокое почтение, восхищение по отношению к кому-либо, чему-либо; обожествление кого-либо, чего-либо
in scheme: ruthes
lexicalized sense: 143164-поклонение-n-0
lexicalized sense: 143164-преклонение-n-0
lexicalized sense: 143164-чувство поклонения-ng-0
lexicalized sense: 143164-чувство преклонения-ng-0