ИМПУЛЬС, ПОСЫЛ
type: LexicalConcept
hypernym: http://lod.ruthes.org/resource/concept/106471
hypernym: http://lod.ruthes.org/resource/concept/107379
hypernym: http://lod.ruthes.org/resource/concept/123438
definition: внутреннее побуждение, толчок к чему-либо, обусловленные деятельностью нервных возбудителей
in scheme: ruthes
lexicalized sense: 143223-веление души-ng-0
lexicalized sense: 143223-веление сердца-ng-0
lexicalized sense: 143223-внутреннее веление-ng-0
lexicalized sense: 143223-внутреннее побуждение-ng-0
lexicalized sense: 143223-внутренний голос-ng-0
lexicalized sense: 143223-внутренний импульс-ng-0
lexicalized sense: 143223-внутренний посыл-ng-0
lexicalized sense: 143223-внутренний толчок-ng-0
lexicalized sense: 143223-импульс-n-0
lexicalized sense: 143223-посыл-n-0