ТЮРЬМА (МЕСТО ОТБЫВАНИЯ НАКАЗАНИЯ)
type: LexicalConcept
holonym: http://lod.ruthes.org/resource/concept/8303
hypernym: http://lod.ruthes.org/resource/concept/2278
definition: место, здание, где содержатся лица, приговорённые к заключению, к лишению свободы
in scheme: ruthes
lexicalized sense: 143377-исправительная тюрьма-ng-0
lexicalized sense: 143377-тюрьма-n-0
lexicalized sense: 143377-тюрьма для особо опасных преступников-ng-0