МЕНЬШИНСТВО (СОЦИАЛЬНАЯ ГРУППА)
type: LexicalConcept
hypernym: http://lod.ruthes.org/resource/concept/140006
hyponym: http://lod.ruthes.org/resource/concept/767
definition: социальная группа, составляющая относительно небольшую долю в общем населении
in scheme: ruthes
lexicalized sense: 143830-группа меньшинства-ng-0
lexicalized sense: 143830-меньшинство-n-0