ЛОББИСТ
type: LexicalConcept
holonym: http://lod.ruthes.org/resource/concept/8154
hypernym: http://lod.ruthes.org/resource/concept/107524
definition: тот, кто принадлежит к тому или иному лобби
in scheme: ruthes
lexicalized sense: 143839-лоббист-n-0