ВЫСШИЙ СВЕТ
type: LexicalConcept
association2: http://lod.ruthes.org/resource/concept/148500
hypernym: http://lod.ruthes.org/resource/concept/149847
meronym: http://lod.ruthes.org/resource/concept/148499
definition: светское общество, узкий круг людей, принадлежащих к элитарным привилегированным слоям общества, связанный определенными узами условностей; истеблишмент
in scheme: ruthes
lexicalized sense: 143901-бомонд-n-0
lexicalized sense: 143901-высший свет-ng-0
lexicalized sense: 143901-свет-n-0
lexicalized sense: 143901-светский-adj-0
lexicalized sense: 143901-светское общество-ng-0