КОНЦЕРТНЫЙ ЗАЛ
type: LexicalConcept
holonym: http://lod.ruthes.org/resource/concept/9588
hypernym: http://lod.ruthes.org/resource/concept/115337
hypernym: http://lod.ruthes.org/resource/concept/145190
hyponym: http://lod.ruthes.org/resource/concept/115397
definition: Помещение, где устраиваются концерты и представления
in scheme: ruthes
lexicalized sense: 1445-концертная площадка-ng-0
lexicalized sense: 1445-концертный зал-ng-0