ИНТЕРВЕНЦИЯ НА РЫНКЕ
type: LexicalConcept
association1: http://lod.ruthes.org/resource/concept/2079
hypernym: http://lod.ruthes.org/resource/concept/138620
definition: валютная интервенция, значительное разовое целенаправленное воздействие центрального банка страны на валютный рынок и валютный курс, осуществляемое путём продажи или закупки банком крупных партий иностранной валюты
in scheme: ruthes
lexicalized sense: 145614-государственная интервенция-ng-0
lexicalized sense: 145614-интервенционная операция-ng-0
lexicalized sense: 145614-интервенционный-adj-0
lexicalized sense: 145614-интервенция-n-0
lexicalized sense: 145614-интервенция на рынке-ng-0
lexicalized sense: 145614-рыночная интервенция-ng-0
lexicalized sense: 145614-финансовая интервенция-ng-0