ВИТАМИННЫЙ ПРЕПАРАТ
type: LexicalConcept
association1: http://lod.ruthes.org/resource/concept/2980
hypernym: http://lod.ruthes.org/resource/concept/1067
hyponym: http://lod.ruthes.org/resource/concept/113194
definition: низкомолекулярное органическое соединение, потребление которого необходимо для нормального развития организма
in scheme: ruthes
lexicalized sense: 146508-витамин-n-0
lexicalized sense: 146508-витаминный-adj-0
lexicalized sense: 146508-витаминный комплекс-ng-0
lexicalized sense: 146508-витаминный препарат-ng-0