ТЕХНИКА (ПРОФЕССИОНАЛЬНЫЕ ПРИЕМЫ)
type: LexicalConcept
association2: http://lod.ruthes.org/resource/concept/119326
association2: http://lod.ruthes.org/resource/concept/147462
association2: http://lod.ruthes.org/resource/concept/853
holonym: http://lod.ruthes.org/resource/concept/139808
hypernym: http://lod.ruthes.org/resource/concept/106828
definition: мастерство, совокупность приёмов, используемых в какой-либо специальной деятельности
in scheme: ruthes
lexicalized sense: 146534-профессиональный прием-ng-0
lexicalized sense: 146534-техника-n-0
lexicalized sense: 146534-техника выполнения-ng-0
lexicalized sense: 146534-техника исполнения-ng-0
lexicalized sense: 146534-технический-adj-0
lexicalized sense: 146534-технический прием-ng-0