РИМСКАЯ КОГОРТА
type: LexicalConcept
holonym: http://lod.ruthes.org/resource/concept/146724
hypernym: http://lod.ruthes.org/resource/concept/124282
definition: тактическая единица древнеримского войска, промежуточная между центурией и легионом
in scheme: ruthes
lexicalized sense: 146725-когорта-n-0
lexicalized sense: 146725-римская когорта-ng-0