ШКОЛА-СТУДИЯ
type: LexicalConcept
hypernym: http://lod.ruthes.org/resource/concept/122
definition: театральный коллектив (обычно молодых актёров), сочетающий учебный процесс и постановку спектаклей
in scheme: ruthes
lexicalized sense: 148663-студийный-adj-0
lexicalized sense: 148663-студия-n-0
lexicalized sense: 148663-студия обучения-ng-0