МОДУЛЬ, АБСОЛЮТНАЯ ВЕЛИЧИНА
type: LexicalConcept
hypernym: http://lod.ruthes.org/resource/concept/113306
definition: абсолютная величина, обозначающая расстояние от нуля
in scheme: ruthes
lexicalized sense: 148993-абсолютная величина-ng-0
lexicalized sense: 148993-модуль-n-0
lexicalized sense: 148993-модуль числа-ng-0
lexicalized sense: 148993-модульная величина-ng-0
lexicalized sense: 148993-модульный-adj-0