УБЕЖДЕНИЕ, ТВЕРДОЕ МНЕНИЕ
type: LexicalConcept
association2: http://lod.ruthes.org/resource/concept/106470
association2: http://lod.ruthes.org/resource/concept/121386
hypernym: http://lod.ruthes.org/resource/concept/106774
definition: твёрдое мнение о чём-либо, вера во что-либо
in scheme: ruthes
lexicalized sense: 149002-твердое мнение-ng-0
lexicalized sense: 149002-твердое убеждение-ng-0
lexicalized sense: 149002-убеждение-n-0