ЧЕРНЫЙ ВОЗВРАТ, ОТКАТ
type: LexicalConcept
hypernym: http://lod.ruthes.org/resource/concept/660
definition: вид взятки должностному лицу, принимающему решение о расходовании денежных средств; уплачиваемая ему получателем средств доля от их суммы
in scheme: ruthes
lexicalized sense: 149012-откат-n-0
lexicalized sense: 149012-откат и распил-ng-0
lexicalized sense: 149012-откат средств-ng-0
lexicalized sense: 149012-откатный-adj-0
lexicalized sense: 149012-распил-n-0
lexicalized sense: 149012-распил денег-ng-0
lexicalized sense: 149012-распил и откат-ng-0
lexicalized sense: 149012-распил средств-ng-0
lexicalized sense: 149012-черный возврат-ng-0
lexicalized sense: 149012-черный откат-ng-0