КАССИР, РАБОТНИК КАССЫ
type: LexicalConcept
holonym: http://lod.ruthes.org/resource/concept/142870
hypernym: http://lod.ruthes.org/resource/concept/2550
definition: служащая, ведающая кассой или сидящая за кассовым аппаратом
in scheme: ruthes
lexicalized sense: 149353-кассир-n-0
lexicalized sense: 149353-кассирша-n-0
lexicalized sense: 149353-работник кассы-ng-0