ОЩУЩЕНИЕ НА ОЩУПЬ
type: LexicalConcept
hypernym: http://lod.ruthes.org/resource/concept/106911
hyponym: http://lod.ruthes.org/resource/concept/113829
hyponym: http://lod.ruthes.org/resource/concept/118696
hyponym: http://lod.ruthes.org/resource/concept/127189
definition: распознавание кого-л., чего-л. осязанием; ощупывание
in scheme: ruthes
lexicalized sense: 149851-ощупь-n-0
lexicalized sense: 149851-ощущение на ощупь-ng-0