ПРИСПОСОБЛЯЕМОСТЬ, ГИБКОСТЬ
type: LexicalConcept
holonym: http://lod.ruthes.org/resource/concept/106673
hypernym: http://lod.ruthes.org/resource/concept/106765
hyponym: http://lod.ruthes.org/resource/concept/131968
definition: способность легко, быстро приспосабливаться к обстоятельствам
in scheme: ruthes
lexicalized sense: 149947-гибкий-adj-0
lexicalized sense: 149947-гибкость-n-0
lexicalized sense: 149947-приспособляемость-n-0
lexicalized sense: 149947-способность приспосабливаться-ng-0
lexicalized sense: 149947-умение приспосабливаться-ng-0
lexicalized sense: 149947-умение приспособиться-ng-0