ИТОГ РАСЧЕТОВ
type: LexicalConcept
holonym: http://lod.ruthes.org/resource/concept/133967
hypernym: http://lod.ruthes.org/resource/concept/110690
hyponym: http://lod.ruthes.org/resource/concept/154675
definition: сумма, результат вычислений; общая сумма счетов
in scheme: ruthes
lexicalized sense: 150208-итог-n-0
lexicalized sense: 150208-итог подсчетов-ng-0
lexicalized sense: 150208-итог расчетов-ng-0
lexicalized sense: 150208-итоговая сумма-ng-0
lexicalized sense: 150208-итоговая цифра-ng-0
lexicalized sense: 150208-итоговый-adj-0
lexicalized sense: 150208-суммарная величина-ng-0
lexicalized sense: 150208-суммарный-adj-0
lexicalized sense: 150208-суммарный итог-ng-0
lexicalized sense: 150208-суммарный результат-ng-0