ПРИНУДИТЕЛЬНАЯ ЛИКВИДАЦИЯ
type: LexicalConcept
hypernym: http://lod.ruthes.org/resource/concept/106527
definition: ликвидировать, прекратить существование чего-либо
in scheme: ruthes
lexicalized sense: 150332-принудительная ликвидация-ng-0
lexicalized sense: 150332-разгонять-v-0
lexicalized sense: 150332-разогнать-v-0