ПЕНСИЯ
type: LexicalConcept
association2: http://lod.ruthes.org/resource/concept/2367
holonym: http://lod.ruthes.org/resource/concept/2366
hypernym: http://lod.ruthes.org/resource/concept/1507
definition: регулярно выдаваемое денежное пособие, выплачиваемое гражданам из общественных фондов в старости, а также в случае инвалидности, потери кормильца и некоторых других случаях
in scheme: ruthes
lexicalized sense: 1511-государственная пенсия-ng-0
lexicalized sense: 1511-месячная пенсия-ng-0
lexicalized sense: 1511-пенсионная выплата-ng-0
lexicalized sense: 1511-пенсионный-adj-0
lexicalized sense: 1511-пенсия-n-0