РЕЗКИЙ ПО ЦВЕТУ
type: LexicalConcept
hypernym: http://lod.ruthes.org/resource/concept/117905
hypernym: http://lod.ruthes.org/resource/concept/118355
definition: резкий, яркого насыщенного оттенка (о цвете)
in scheme: ruthes
lexicalized sense: 151572-резкий по цвету-adjg-0
lexicalized sense: 151572-ядовитость-n-0
lexicalized sense: 151572-ядовитость цвета-ng-0
lexicalized sense: 151572-ядовитый-adj-0
lexicalized sense: 151572-ядовитый по цвету-adjg-0
lexicalized sense: 151572-ядовитый цвет-ng-0