СЛАБОРАЗВИТЫЙ
type: LexicalConcept
hypernym: http://lod.ruthes.org/resource/concept/114915
hypernym: http://lod.ruthes.org/resource/concept/121261
hypernym: http://lod.ruthes.org/resource/concept/153675
hyponym: http://lod.ruthes.org/resource/concept/119783
definition: остановившийся, задержавшийся в своём развитии
in scheme: ruthes
lexicalized sense: 153676-недоразвитие-n-0
lexicalized sense: 153676-недоразвитость-n-0
lexicalized sense: 153676-недоразвитый-adj-0
lexicalized sense: 153676-неразвитой-adj-0
lexicalized sense: 153676-неразвитость-n-0
lexicalized sense: 153676-неразвитый-adj-0
lexicalized sense: 153676-слаборазвитость-n-0
lexicalized sense: 153676-слаборазвитый-adj-0