СООБЩЕСТВО (СОВОКУПНОСТЬ ЛЮДЕЙ)
type: LexicalConcept
hypernym: http://lod.ruthes.org/resource/concept/111488
hypernym: http://lod.ruthes.org/resource/concept/138999
definition: объединение, группа из некоторого числа людей, народов, государств, организаций, связанных общими интересами, целями
in scheme: ruthes
lexicalized sense: 153760-мир-n-0
lexicalized sense: 153760-сообщество-n-0
lexicalized sense: 153760-сообщество людей-ng-0