ГРЕБЕНЬ (УКРАШЕНИЕ)
type: LexicalConcept
hypernym: http://lod.ruthes.org/resource/concept/124697
definition: продолговатая пластинка с рядом зубьев по обеим сторонам, служащая для расчесывания волос; расчёска с крупными зубьями либо украшение для волос, выполненное в виде такой расчёски
in scheme: ruthes
lexicalized sense: 153829-гребень-n-0
lexicalized sense: 153829-гребень для волос-ng-0