ПРОФЕССИЯ
type: LexicalConcept
association2: http://lod.ruthes.org/resource/concept/137389
association2: http://lod.ruthes.org/resource/concept/140027
association2: http://lod.ruthes.org/resource/concept/140122
association2: http://lod.ruthes.org/resource/concept/142237
association2: http://lod.ruthes.org/resource/concept/147245
association2: http://lod.ruthes.org/resource/concept/1610
association2: http://lod.ruthes.org/resource/concept/3618
association2: http://lod.ruthes.org/resource/concept/4088
holonym: http://lod.ruthes.org/resource/concept/2550
hypernym: http://lod.ruthes.org/resource/concept/106501
hyponym: http://lod.ruthes.org/resource/concept/140205
hyponym: http://lod.ruthes.org/resource/concept/1630
hyponym: http://lod.ruthes.org/resource/concept/6723
definition: род трудовой деятельности, занятий, требующий определённой подготовки и являющийся обычно источником существования
in scheme: ruthes
lexicalized sense: 1614-квалификация-n-0
lexicalized sense: 1614-профессиональная принадлежность-ng-0
lexicalized sense: 1614-профессиональный-adj-0
lexicalized sense: 1614-профессия-n-0
lexicalized sense: 1614-специальность-n-0