ПРАВОВАЯ ЮРИСДИКЦИЯ
type: LexicalConcept
holonym: http://lod.ruthes.org/resource/concept/422
hypernym: http://lod.ruthes.org/resource/concept/115842
hyponym: http://lod.ruthes.org/resource/concept/143261
hyponym: http://lod.ruthes.org/resource/concept/7660
hyponym: http://lod.ruthes.org/resource/concept/7793
definition: правовая сфера, на которую распространяются полномочия определённого органа власти
in scheme: ruthes
lexicalized sense: 1645-правовая юрисдикция-ng-0
lexicalized sense: 1645-юрисдикционный-adj-0
lexicalized sense: 1645-юрисдикция-n-0