ТАМОЖНЯ
type: LexicalConcept
association: http://lod.ruthes.org/resource/concept/1655
association: http://lod.ruthes.org/resource/concept/7795
hypernym: http://lod.ruthes.org/resource/concept/117462
hypernym: http://lod.ruthes.org/resource/concept/2373
meronym: http://lod.ruthes.org/resource/concept/6156
definition: государственный орган, осуществляющий контроль за перемещением через границу почты, товаров, грузов, ведущий учёт таких перемещений и взимающий установленные пошлины и специальные сбор
in scheme: ruthes
lexicalized sense: 1654-таможенный-adj-0
lexicalized sense: 1654-таможенный пункт-ng-0
lexicalized sense: 1654-таможня-n-0