СУДОПРОИЗВОДСТВО
type: LexicalConcept
association2: http://lod.ruthes.org/resource/concept/6304
association2: http://lod.ruthes.org/resource/concept/9867
holonym: http://lod.ruthes.org/resource/concept/3015
hypernym: http://lod.ruthes.org/resource/concept/106562
hyponym: http://lod.ruthes.org/resource/concept/1852
hyponym: http://lod.ruthes.org/resource/concept/2456
meronym: http://lod.ruthes.org/resource/concept/140747
meronym: http://lod.ruthes.org/resource/concept/140753
meronym: http://lod.ruthes.org/resource/concept/143732
meronym: http://lod.ruthes.org/resource/concept/143733
meronym: http://lod.ruthes.org/resource/concept/144155
meronym: http://lod.ruthes.org/resource/concept/145128
meronym: http://lod.ruthes.org/resource/concept/145133
meronym: http://lod.ruthes.org/resource/concept/149459
meronym: http://lod.ruthes.org/resource/concept/2458
meronym: http://lod.ruthes.org/resource/concept/3201
meronym: http://lod.ruthes.org/resource/concept/4584
meronym: http://lod.ruthes.org/resource/concept/6573
meronym: http://lod.ruthes.org/resource/concept/7660
meronym: http://lod.ruthes.org/resource/concept/7730
meronym: http://lod.ruthes.org/resource/concept/7793
meronym: http://lod.ruthes.org/resource/concept/7827
definition: деятельность судебных органов, связанная с рассмотрением уголовных и гражданских дел; судебный процесс
in scheme: ruthes
lexicalized sense: 1853-отправление правосудия-ng-0
lexicalized sense: 1853-производство-n-0
lexicalized sense: 1853-производство в суде-ng-0
lexicalized sense: 1853-производство дел-ng-0
lexicalized sense: 1853-производство по делам-ng-0
lexicalized sense: 1853-процессуальный-adj-0
lexicalized sense: 1853-судебная деятельность-ng-0
lexicalized sense: 1853-судебная процедура-ng-0
lexicalized sense: 1853-судебное производство-ng-0
lexicalized sense: 1853-судебный порядок-ng-0
lexicalized sense: 1853-судопроизводственный-adj-0
lexicalized sense: 1853-судопроизводство-n-0