МИНИСТР
type: LexicalConcept
association2: http://lod.ruthes.org/resource/concept/7112
holonym: http://lod.ruthes.org/resource/concept/1559
holonym: http://lod.ruthes.org/resource/concept/2546
hypernym: http://lod.ruthes.org/resource/concept/6668
hypernym: http://lod.ruthes.org/resource/concept/7093
hypernym: http://lod.ruthes.org/resource/concept/9606
hyponym: http://lod.ruthes.org/resource/concept/133954
hyponym: http://lod.ruthes.org/resource/concept/137844
hyponym: http://lod.ruthes.org/resource/concept/3963
hyponym: http://lod.ruthes.org/resource/concept/6242
hyponym: http://lod.ruthes.org/resource/concept/6246
hyponym: http://lod.ruthes.org/resource/concept/6247
hyponym: http://lod.ruthes.org/resource/concept/6249
hyponym: http://lod.ruthes.org/resource/concept/6253
meronym: http://lod.ruthes.org/resource/concept/142900
definition: член правительства, возглавляющий министерство
in scheme: ruthes
lexicalized sense: 1875-глава министерства-ng-0
lexicalized sense: 1875-глава отрасли-ng-0
lexicalized sense: 1875-глава федерального ведомства-ng-0
lexicalized sense: 1875-госминистр-n-0
lexicalized sense: 1875-министерский-adj-0
lexicalized sense: 1875-министр-n-0
lexicalized sense: 1875-министр правительства-ng-0
lexicalized sense: 1875-руководитель министерства-ng-0
lexicalized sense: 1875-руководитель отрасли-ng-0
lexicalized sense: 1875-член кабинета-ng-0
lexicalized sense: 1875-член правительства-ng-0