РУССКИЕ
type: LexicalConcept
association2: http://lod.ruthes.org/resource/concept/140594
association2: http://lod.ruthes.org/resource/concept/147026
association2: http://lod.ruthes.org/resource/concept/6725
hypernym: http://lod.ruthes.org/resource/concept/139247
hypernym: http://lod.ruthes.org/resource/concept/139862
hypernym: http://lod.ruthes.org/resource/concept/3291
hyponym: http://lod.ruthes.org/resource/concept/147327
definition: представитель русского народа, иногда гражданин России или человек, имеющий российское происхождение
in scheme: ruthes
lexicalized sense: 1917-великоросс-n-0
lexicalized sense: 1917-великоросска-n-0
lexicalized sense: 1917-русская-n-0
lexicalized sense: 1917-русская нация-ng-0
lexicalized sense: 1917-русский-adj-0
lexicalized sense: 1917-русское население-ng-0
lexicalized sense: 1917-этнически русские-adjg-0
lexicalized sense: 1917-этнические русские-adjg-0