ПРАВОВОЙ СТАТУС
type: LexicalConcept
holonym: http://lod.ruthes.org/resource/concept/422
hypernym: http://lod.ruthes.org/resource/concept/152578
hyponym: http://lod.ruthes.org/resource/concept/120695
hyponym: http://lod.ruthes.org/resource/concept/127130
hyponym: http://lod.ruthes.org/resource/concept/134066
hyponym: http://lod.ruthes.org/resource/concept/137417
hyponym: http://lod.ruthes.org/resource/concept/138210
hyponym: http://lod.ruthes.org/resource/concept/140673
hyponym: http://lod.ruthes.org/resource/concept/141600
hyponym: http://lod.ruthes.org/resource/concept/141966
hyponym: http://lod.ruthes.org/resource/concept/143928
hyponym: http://lod.ruthes.org/resource/concept/148908
hyponym: http://lod.ruthes.org/resource/concept/150167
hyponym: http://lod.ruthes.org/resource/concept/153530
hyponym: http://lod.ruthes.org/resource/concept/1563
hyponym: http://lod.ruthes.org/resource/concept/281
hyponym: http://lod.ruthes.org/resource/concept/3673
hyponym: http://lod.ruthes.org/resource/concept/4730
hyponym: http://lod.ruthes.org/resource/concept/6185
hyponym: http://lod.ruthes.org/resource/concept/7648
hyponym: http://lod.ruthes.org/resource/concept/7726
hyponym: http://lod.ruthes.org/resource/concept/7735
hyponym: http://lod.ruthes.org/resource/concept/7818
definition: официальное положение, место в правовой или другой структуре
in scheme: ruthes
lexicalized sense: 2081-правовое положение-ng-0
lexicalized sense: 2081-правовой статус-ng-0
lexicalized sense: 2081-статус-n-0
lexicalized sense: 2081-юридический статус-ng-0
lexicalized sense: 2081-юридическое положение-ng-0