СУДЬЯ
type: LexicalConcept
holonym: http://lod.ruthes.org/resource/concept/661
hypernym: http://lod.ruthes.org/resource/concept/6442
hyponym: http://lod.ruthes.org/resource/concept/132165
hyponym: http://lod.ruthes.org/resource/concept/4958
hyponym: http://lod.ruthes.org/resource/concept/667
definition: должностное лицо государства, являющееся носителем судебной власти, осуществляющее правосудие и выносящее решение по судебному делу
in scheme: ruthes
lexicalized sense: 2454-служитель правосудия-ng-0
lexicalized sense: 2454-служитель фемиды-ng-0
lexicalized sense: 2454-судейские кадры-ng-0
lexicalized sense: 2454-судейский-adj-0
lexicalized sense: 2454-судейское сообщество-ng-0
lexicalized sense: 2454-судья-n-0
lexicalized sense: 2454-член суда-ng-0