КОММЕРЦИАЛИЗАЦИЯ
type: LexicalConcept
association1: http://lod.ruthes.org/resource/concept/560
hypernym: http://lod.ruthes.org/resource/concept/833
definition: внедрение коммерческих отношений, перевод или переход чего-либо на коммерческую основу
in scheme: ruthes
lexicalized sense: 2466-извлекать коммерческую выгоду-vg-0
lexicalized sense: 2466-извлекать прибыль-vg-0
lexicalized sense: 2466-коммерциализация-n-0
lexicalized sense: 2466-коммерциализировать-v-0
lexicalized sense: 2466-коммерциализовать-v-0
lexicalized sense: 2466-превращать в источник дохода-vg-0