СОУЧАСТНИК ПРЕСТУПЛЕНИЯ
type: LexicalConcept
association2: http://lod.ruthes.org/resource/concept/7011
holonym: http://lod.ruthes.org/resource/concept/153524
hypernym: http://lod.ruthes.org/resource/concept/112083
hypernym: http://lod.ruthes.org/resource/concept/639
hyponym: http://lod.ruthes.org/resource/concept/149700
hyponym: http://lod.ruthes.org/resource/concept/7317
definition: тот, кто пpоходит по одному уголовному делу с кем-либо
in scheme: ruthes
lexicalized sense: 2523-подельник-n-0
lexicalized sense: 2523-подельница-n-0
lexicalized sense: 2523-подельщик-n-0
lexicalized sense: 2523-сообщник-n-0
lexicalized sense: 2523-сообщник преступления-ng-0
lexicalized sense: 2523-сообщница-n-0
lexicalized sense: 2523-сообщнический-adj-0
lexicalized sense: 2523-соучастник преступления-ng-0
lexicalized sense: 2523-соучастница преступления-ng-0
lexicalized sense: 2523-участник преступления-ng-0
lexicalized sense: 2523-участница преступления-ng-0