ВОЕННАЯ КОНВЕРСИЯ
type: LexicalConcept
association1: http://lod.ruthes.org/resource/concept/133890
holonym: http://lod.ruthes.org/resource/concept/6254
holonym: http://lod.ruthes.org/resource/concept/771
hypernym: http://lod.ruthes.org/resource/concept/3426
hypernym: http://lod.ruthes.org/resource/concept/833
definition: перевод на производство гражданской продукции и товаров народного потребления (о предприятиях военно-промышленного комплекса)
in scheme: ruthes
lexicalized sense: 2527-военная конверсия-ng-0
lexicalized sense: 2527-конверсионная деятельность-ng-0
lexicalized sense: 2527-конверсионная сфера-ng-0
lexicalized sense: 2527-конверсионное мероприятие-ng-0
lexicalized sense: 2527-конверсионный-adj-0
lexicalized sense: 2527-конверсировать-v-0
lexicalized sense: 2527-конверсия-n-0
lexicalized sense: 2527-переориентация военного производства-ng-0