РЕДАКТОР
type: LexicalConcept
hypernym: http://lod.ruthes.org/resource/concept/2674
definition: работник редакции, тот, кто проверяет и исправляет текст, готовя его к публикации
in scheme: ruthes
lexicalized sense: 2676-редактор-n-0
lexicalized sense: 2676-редакторский-adj-0
lexicalized sense: 2676-редакторша-n-0