СУДЕБНЫЙ ИСК
type: LexicalConcept
association1: http://lod.ruthes.org/resource/concept/115415
association2: http://lod.ruthes.org/resource/concept/140751
holonym: http://lod.ruthes.org/resource/concept/6571
hypernym: http://lod.ruthes.org/resource/concept/147805
hypernym: http://lod.ruthes.org/resource/concept/2225
hyponym: http://lod.ruthes.org/resource/concept/135019
meronym: http://lod.ruthes.org/resource/concept/4132
meronym: http://lod.ruthes.org/resource/concept/4133
definition: документ, заявление, подаваемое одной стороной (истцом) в суд или арбитраж против другой стороны (ответчика)
in scheme: ruthes
lexicalized sense: 2817-иск-n-0
lexicalized sense: 2817-исковый-adj-0
lexicalized sense: 2817-судебный иск-ng-0