ВЫБОРЫ
type: LexicalConcept
association1: http://lod.ruthes.org/resource/concept/10119
association1: http://lod.ruthes.org/resource/concept/121187
association2: http://lod.ruthes.org/resource/concept/145739
association2: http://lod.ruthes.org/resource/concept/6709
hypernym: http://lod.ruthes.org/resource/concept/154391
hyponym: http://lod.ruthes.org/resource/concept/121891
hyponym: http://lod.ruthes.org/resource/concept/8045
hyponym: http://lod.ruthes.org/resource/concept/9926
meronym: http://lod.ruthes.org/resource/concept/1563
meronym: http://lod.ruthes.org/resource/concept/1565
meronym: http://lod.ruthes.org/resource/concept/3779
meronym: http://lod.ruthes.org/resource/concept/3896
meronym: http://lod.ruthes.org/resource/concept/448
meronym: http://lod.ruthes.org/resource/concept/449
meronym: http://lod.ruthes.org/resource/concept/450
definition: процедура избрания представителей государственной власти, органов местного самоуправления, а также руководящих органов общественных организаций, осуществляемая с помощью голосования
in scheme: ruthes
lexicalized sense: 287-выбирать-v-0
lexicalized sense: 287-выборная деятельность-ng-0
lexicalized sense: 287-выборная проблематика-ng-0
lexicalized sense: 287-выборная процедура-ng-0
lexicalized sense: 287-выборно-избирательный-adj-0
lexicalized sense: 287-выборный-adj-0
lexicalized sense: 287-выборы-n-0
lexicalized sense: 287-выборы в органы государственной власти-ng-0
lexicalized sense: 287-выбрать-v-0
lexicalized sense: 287-избирание-n-0
lexicalized sense: 287-избирательная машина-ng-0
lexicalized sense: 287-избирательная процедура-ng-0
lexicalized sense: 287-избирательный-adj-0
lexicalized sense: 287-избирать-v-0
lexicalized sense: 287-избрание-n-0
lexicalized sense: 287-избрать-v-0
lexicalized sense: 287-избраться-v-0
lexicalized sense: 287-перевыбирать-v-0
lexicalized sense: 287-перевыборы-n-0
lexicalized sense: 287-перевыбрать-v-0
lexicalized sense: 287-переизбирать-v-0
lexicalized sense: 287-переизбрание-n-0
lexicalized sense: 287-переизбрать-v-0