ЗАБОЛЕВАЕМОСТЬ
type: LexicalConcept
holonym: http://lod.ruthes.org/resource/concept/616
hypernym: http://lod.ruthes.org/resource/concept/4465
hyponym: http://lod.ruthes.org/resource/concept/152598
definition: распространённость заболеваний среди кого-либо
in scheme: ruthes
lexicalized sense: 2947-заболеваемость-n-0
lexicalized sense: 2947-показатель заболеваемости-ng-0