СУДОУСТРОЙСТВО
type: LexicalConcept
association: http://lod.ruthes.org/resource/concept/1381
association: http://lod.ruthes.org/resource/concept/1864
association2: http://lod.ruthes.org/resource/concept/9867
holonym: http://lod.ruthes.org/resource/concept/422
hypernym: http://lod.ruthes.org/resource/concept/115790
meronym: http://lod.ruthes.org/resource/concept/134994
meronym: http://lod.ruthes.org/resource/concept/1853
meronym: http://lod.ruthes.org/resource/concept/1855
meronym: http://lod.ruthes.org/resource/concept/6637
definition: система судебных учреждений; министерство юстиции, судебное ведомство
in scheme: ruthes
lexicalized sense: 3015-правосудие-n-0
lexicalized sense: 3015-система правосудия-ng-0
lexicalized sense: 3015-система юстиции-ng-0
lexicalized sense: 3015-судебная машина-ng-0
lexicalized sense: 3015-судебная система-ng-0
lexicalized sense: 3015-судебно-правовая система-ng-0
lexicalized sense: 3015-судебное строительство-ng-0
lexicalized sense: 3015-судебный механизм-ng-0
lexicalized sense: 3015-судоустройственный-adj-0
lexicalized sense: 3015-судоустройство-n-0
lexicalized sense: 3015-фемида-n-0
lexicalized sense: 3015-юстиция-n-0