ЦЕХ (ПРОИЗВОДСТВЕННОЕ ПОДРАЗДЕЛЕНИЕ)
type: LexicalConcept
association2: http://lod.ruthes.org/resource/concept/120833
hypernym: http://lod.ruthes.org/resource/concept/114757
hypernym: http://lod.ruthes.org/resource/concept/145800
hypernym: http://lod.ruthes.org/resource/concept/146276
hyponym: http://lod.ruthes.org/resource/concept/141686
hyponym: http://lod.ruthes.org/resource/concept/5719
definition: основная производственная единица, отдел промышленного предприятия (фабрики или завода), где вырабатывается определённая продукция или завершается какой-либо процесс производства
in scheme: ruthes
lexicalized sense: 3065-производственные мастерские-adjg-0
lexicalized sense: 3065-производственный цех-ng-0
lexicalized sense: 3065-цех-n-0
lexicalized sense: 3065-цех по производству-ng-0
lexicalized sense: 3065-цеховой-adj-0