РЕЦЕПТ ВРАЧА
type: LexicalConcept
association1: http://lod.ruthes.org/resource/concept/1045
association1: http://lod.ruthes.org/resource/concept/1067
holonym: http://lod.ruthes.org/resource/concept/1061
holonym: http://lod.ruthes.org/resource/concept/117171
hypernym: http://lod.ruthes.org/resource/concept/2428
definition: письменное указание врача об изготовлении и употреблении лекарства
in scheme: ruthes
lexicalized sense: 3081-медицинский рецепт-ng-0
lexicalized sense: 3081-рецепт-n-0
lexicalized sense: 3081-рецепт врача-ng-0
lexicalized sense: 3081-рецепт на лекарство-ng-0